NO,Incidence rate ,AGE,SEX,Cost (IDR),LOS,diabetes,hypertension,dyslipidemia,AKI,CKD,Onset (min),onset (hour),obesity,stroke,heart failure,lethal aritmia,pericarditis,tamponade jantung,cardiogenic shock,death,type of therapy,Unnamed: 22,D2NT (menit),D2BT,D2WT,Dx2WC,Dx2NT,Door to diagnosis,ischemic time
1,Sep'18,47,L,52535188,5,yes,no,no,no,no,1200,20,no,no,no,no,no,no,no,no,PCI Urgent,,,,,,,,
2,Sep'18,74,L,29559592,5,yes,yes,yes,no,yes,480,8,no,no,no,no,no,no,no,tida,Conservatif,,,,,,,,
3,Sep'18,54,L,59871192,6,no,no,yes,yes,no,2880,48,no,no,yes,no,no,no,no,no,Conservatif,,,,,,,,
4,Sep'18,55,L,42296566,6,no,yes,yes,no,no,720,12,yes,no,no,no,no,no,no,no,Conservatif,,,,,,,,
5,Sep'18,67,L,56037386,6,yes,no,yes,yes,yes,540,9,no,no,no,no,no,no,no,no,PCI Urgent,,,,,,,,
6,Sep'18,61,L,69553678,5,no,no,no,no,no,360,6,no,no,no,no,no,no,no,no,PPCI,,,147,137,124,,13,497
7,Okt'18,64,L,48491658,5,no,no,no,no,no,360,6,no,no,no,no,no,no,no,no,PPCI,,,209,181,165,,16,541
8,Okt'18,66,L,33646698,6,no,yes,no,no,no,360,6,no,no,no,no,no,no,no,no,PPCI,,,165,150,84,,66,510
9,Okt'18,57,L,152590058,16,no,yes,no,no,no,330,5.5,no,no,yes,no,no,no,no,no,PPCI,,,150,132,49,,83,462
10,Okt'18,59,L,71968666,2,yes,yes,no,no,no,300,5,no,no,no,no,no,no,no,yes,PPCI,,,235,228,153,,75,528
11,Okt'18,54,L,55962898,5,yes,yes,no,no,yes,5760,96,no,no,no,no,no,no,no,yes,Conservatif,,,,,,,,
12,Okt'18,59,P,27014573,10,no,yes,no,yes,yes,720,12,no,no,no,no,no,no,no,no,Conservatif,,,,,,,,
13,Okt'18,64,L,75365303,11,no,yes,yes,yes,no,4320,72,no,no,no,no,no,no,no,no,Conservatif,,,,,,,,
14,Nov'18,56,L,30856431,5,no,no,yes,no,no,150,2.5,yes,no,no,no,no,no,no,no,PPCI,,,291,280,267,,13,430
15,Nov'18,38,L,48934639,5,yes,yes,no,yes,no,360,6,yes,no,no,no,no,no,no,no,PPCI,,,216,211,209,,2,571
16,Nov'18,40,L,55956783,6,no,no,no,no,no,360,6,no,no,no,no,no,no,no,no,PPCI,,,189,180,167,,13,540
17,Nov'18,54,L,59625374,7,yes,yes,yes,yes,no,840,14,no,no,no,no,no,no,no,no,PPCI,,,276,266,254,,12,1106
18,Nov'18,64,L,42753903,5,yes,yes,no,no,no,300,5,no,no,no,no,no,no,no,no,PPCI,,,123,92,90,,2,392
19,Nov'18,66,L,53552975,6,no,yes,no,yes,no,1320,22,no,no,no,no,no,no,no,no,Conservatif,,,,,,,,
20,Nov'18,52,L,57136713,7,yes,no,yes,no,no,480,8,no,no,no,no,no,no,no,no,Fibrinolytic,,195,,,,160,35,675
21,Nov'18,81,L,29414859,7,yes,yes,no,no,no,420,7,no,no,no,no,no,no,no,no,Conservatif,,,,,,,,
22,Nov'18,79,P,31596287,5,no,yes,no,no,yes,720,12,no,no,no,no,no,no,no,no,PPCI,,,244,231,219,,12,951
23,Nov'18,65,L,37456328,9,no,yes,yes,no,no,780,13,no,no,no,no,no,no,no,no,Conservatif,,,,,,,,
24,Nov'18,46,L,43833214,5,no,yes,no,no,no,480,8,no,no,no,no,no,no,no,no,Conservatif,,,,,,,,
25,Nov'18,53,L,64743633,6,no,no,yes,no,no,180,3,no,no,no,no,no,no,no,no,Fibrinolytic,,236,,,,219,17,416
26,Nov'18,73,P,30571124,7,no,yes,no,no,no,780,13,no,no,no,yes,no,no,no,no,Conservatif,,,,,,,,
27,Des'18,56,P,67787700,8,yes,yes,no,no,yes,510,8.5,no,no,yes,no,no,no,no,no,PPCI,,,211,157,139,,18,667
28,Des'18,48,L,51618023,4,yes,yes,yes,no,no,240,4,no,no,no,no,no,no,no,no,PPCI,,,137,133,132,,1,373
29,Des'18,54,L,51188812,7,no,no,no,yes,no,300,5,no,no,no,no,no,no,yes,no,PPCI,,,179,166,154,,12,466
30,Des'18,50,L,58026878,9,yes,no,yes,no,no,300,5,yes,no,no,no,no,no,no,no,PPCI,,,432,422,87,,335,722
31,Des'18,55,L,51937605,5,no,yes,yes,no,no,420,7,no,no,no,no,no,no,no,no,PPCI,,,105,103,45,,58,523
32,Des'18,61,L,66018463,5,no,yes,yes,no,no,60,1,no,no,no,no,no,no,no,no,PPCI,,,134,120,90,,30,180
33,Des'18,42,L,68957673,8,no,no,yes,no,no,1080,18,no,no,no,no,no,no,no,no,PPCI,,,137,117,106,,11,1197
34,Des'18,45,L,91505757,5,yes,no,yes,no,no,360,6,no,no,no,no,no,no,no,no,PPCI,,,256,251,225,,26,611
35,Des'18,68,P,21324068,4,no,yes,no,no,no,4320,72,no,no,no,no,no,no,no,no,Conservatif,,,,,,,,
36,Des'18,51,L,24738803,7,no,no,no,no,no,960,16,no,no,no,no,no,no,no,no,Conservatif,,,,,,,,
37,Des'18,71,P,27358302,6,no,no,no,no,no,4320,72,no,no,no,no,no,no,no,no,Conservatif,,,,,,,,
38,Jan'19,29.32,L,11950624,6,no,yes,no,no,no,660,11,yes,no,no,no,no,no,no,no,Conservatif,,,,,,,,
39,Jan'19,54,L,49860062,5,no,yes,no,yes,no,600,10,no,no,no,no,no,no,no,no,PPCI,,,195,171,161,,10,771
40,Jan'19,51,L,66190814,6,yes,yes,no,no,no,240,4,no,no,no,no,no,no,no,no,PPCI,,,173,146,90,,56,386
41,Jan'19,67,L,44625399,8,no,yes,no,yes,no,360,6,no,no,no,no,no,no,no,no,PPCI,,,217,217,216,,1,577
42,Jan'19,48,L,48636931,4,yes,yes,no,no,no,300,5,no,no,no,no,no,no,no,no,PPCI,,,217,211,202,,9,511
43,Jan'19,84,P,67127131,6,no,yes,no,yes,no,540,9,no,no,no,no,no,no,yes,yes,PPCI,,,221,217,192,,25,757
44,Jan'19,65,L,68683099,7,yes,no,no,yes,no,960,16,no,no,no,no,no,no,no,no,PPCI,,,162,160,147,,13,1120
45,Jan'19,45,L,54426450,5,no,yes,no,no,no,10080,168,no,no,no,no,no,no,no,no,PPCI,,,166,163,129,,34,10243
46,Jan'19,48,L,73079343,3,yes,no,no,yes,no,480,8,no,no,no,no,no,no,no,yes,PPCI,,,177,223,207,,16,703
47,Jan'19,58,P,63576258,6,no,no,no,yes,yes,960,16,yes,no,no,no,no,no,no,yes,Conservatif,,,,,,,,
48,Feb'19,70,L,66655916,6,no,yes,no,yes,no,660,11,no,no,no,no,no,no,yes,no,PPCI,,,106,90,76,,14,750
49,Feb'19,65,P,45721600,4,no,yes,yes,no,no,420,7,no,no,no,no,no,no,no,no,PPCI,,,143,125,119,,6,545
50,Feb'19,60,L,51882870,4,no,yes,no,no,no,300,5,no,no,no,no,no,no,no,no,PPCI,,,510,505,377,,128,805
51,Feb'19,52,P,58335427,10,yes,yes,no,yes,yes,720,12,no,no,no,no,no,no,no,no,PPCI,,,211,208,201,,7,928
52,Feb'19,65,L,56704083,7,yes,yes,no,no,no,1440,24,no,no,no,no,no,no,no,no,Conservatif,,,,,,,,
53,Feb'19,49,L,58417222,5,no,yes,no,no,no,360,6,no,no,no,no,no,no,no,no,PPCI,,,,187,159,,28,547
54,Feb'19,50,L,61806028,3,yes,no,no,yes,no,4320,72,no,no,yes,no,no,no,no,yes,PCI Urgent,,,,,,,,
55,Feb'19,81,L,31149663,10,no,yes,no,yes,yes,1440,24,no,no,no,no,no,no,no,no,Conservatif,,,,,,,,
56,Feb'19,61,L,48134342,7,no,yes,no,yes,no,1440,24,no,no,no,no,no,no,no,no,Conservatif,,,,,,,,
57,Feb'19,61,L,43526133,2,no,no,no,no,no,30,0.5,no,no,no,yes,N?A,no,no,yes,PPCI,,,no,no,no,,,
58,Maret'19,53,L,52208554,4,yes,yes,no,no,no,480,8,no,no,no,no,no,no,no,no,PPCI,,,323,283,252,,31,763
59,Maret'19,80,P,58546370,4,no,yes,no,no,no,180,3,no,no,no,no,no,no,yes,yes,PPCI,,,150,139,137,,2,319
60,Maret'19,42,L,59516753,5,no,yes,yes,no,no,240,4,yes,no,no,no,no,no,no,no,PPCI,,,125,104,84,,20,344
61,Maret'19,41,L,49350809,6,no,yes,yes,no,no,300,5,no,no,yes,yes,no,no,no,no,PPCI,,,129,129,90,,39,429
62,Maret'19,62,L,49771271,6,yes,no,no,no,no,,,no,no,no,no,no,no,no,no,PPCI,,,459,442,152,,290,442
63,Maret'19,66,P,105964284,5,yes,yes,no,no,yes,480,8,no,no,no,no,no,no,no,no,PPCI,,,532,528,276,,252,1008
64,Maret'19,61,L,46564560,6,no,no,yes,no,no,1440,24,no,no,no,no,no,no,no,no,Conservatif,,,,,,,,
65,Maret'19,42,L,41842210,8,yes,no,yes,no,no,780,13,no,no,no,no,no,no,no,no,Conservatif,,,,,,,,
66,April'19,65.34,P,41279999,3,yes,yes,no,no,no,10080,168,no,no,no,no,no,no,no,no,Conservatif,,,,,,,,
67,April'19,37,L,52672625,4,no,yes,no,no,no,480,8,no,no,yes,no,no,no,no,no,PPCI,,,219,211,160,,51,691
68,April'19,50,L,50761681,4,yes,no,no,no,no,120,2,no,no,no,no,no,no,no,no,PPCI,,,130,125,115,,10,245
69,April'19,49,L,43329516,4,no,no,no,no,no,120,2,no,no,no,no,no,no,no,no,PPCI,,,236,221,195,,26,341
70,April'19,75,P,38639305,4,no,yes,yes,no,no,180,3,no,no,no,no,no,no,no,no,PPCI,,,169,166,157,,9,346
71,April'19,55,L,51831006,4,no,no,no,no,no,180,3,no,no,no,no,no,no,no,no,PPCI,,,149,151,147,,4,331
72,April'19,64,L,56784856,4,yes,no,no,no,no,360,6,no,no,no,yes,no,no,no,no,PPCI,,,138,112,83,,29,472
73,April'19,78,L,26856292,6,no,yes,no,yes,no,660,11,no,no,no,no,no,no,no,no,PCI Urgent,,,,,,,,
74,Mei'19,48.18,L,42883133,6,no,yes,no,no,no,300,5,no,no,no,no,no,no,no,no,PPCI,,,125,121,89,,32,421
75,Mei'19,33,L,56498948,4,no,yes,yes,no,yes,240,4,yes,no,no,no,no,no,no,no,PPCI,,,184,161,154,,7,401
76,Mei'19,55,L,41832609,1,yes,no,yes,yes,no,360,6,no,no,no,no,no,no,no,yes,PPCI,,,112,98,90,,8,458
77,Mei'19,78,L,58578347,4,no,yes,no,no,no,360,6,no,no,no,no,no,no,no,no,PPCI,,,122,111,70,,41,471
78,Mei'20,41,L,79265900,4,no,no,no,no,no,330,5.5,no,no,no,yes,no,no,no,no,PPCI,,,291,236,184,,52,566
79,Mei'21,53,L,55677384,5,yes,yes,no,no,yes,210,3.5,no,no,no,no,no,no,no,no,PPCI,,,165,98,90,,8,308
80,Mei'22,39,L,59294800,4,no,no,yes,no,no,600,10,no,no,no,no,no,no,no,no,PPCI,,,167,163,152,,11,763
81,Mei'23,52,L,60951318,5,yes,no,no,yes,no,720,12,no,no,no,yes,no,no,no,no,PPCI,,,238,215,207,,8,935
82,Mei'24,52,L,25689784,7,no,yes,no,no,no,5760,96,no,no,no,no,no,no,no,no,Conservatif,,,,,,,,
83,Mei'25,50,L,45998296,6,yes,yes,no,yes,yes,540,9,no,no,no,no,no,no,no,no,PPCI,,,167,160,139,,21,700
84,Mei'26,48,L,49937774,6,yes,yes,no,no,yes,60,1,no,no,no,no,no,no,no,no,Fibrinolytic,,50,,,,35,15,110
85,Juni'19,54.15,L,45404709,6,yes,yes,no,yes,no,240,4,no,no,no,no,no,no,no,no,PPCI,,,118,104,87,,17,344
86,Juni'19,45,L,54159910,4,no,no,yes,no,no,300,5,no,no,no,no,no,no,no,no,PPCI,,,171,103,88,,15,403
87,Juni'19,80,P,52498525,11,yes,yes,yes,yes,yes,240,4,no,yes,no,no,no,no,no,no,PPCI,,,221,216,201,,15,456
88,Juni'19,60,L,69210000,1,no,no,no,no,no,,,no,no,no,no,no,no,no,no,PPCI,,,124,83,75,,8,83
89,Juni'19,69,L,47117807,3,no,yes,no,no,no,300,5,no,no,no,no,no,no,no,no,PPCI,,,141,131,99,,32,431
90,Juni'19,46,L,51858113,3,yes,no,no,no,no,120,2,no,no,no,no,no,no,no,no,PPCI,,,273,235,219,,16,355
91,Juni'19,52,L,48782449,3,no,no,no,no,no,420,7,no,no,no,no,no,no,no,no,PPCI,,,153,152,144,,8,572
92,Juni'19,64,P,60802401,5,yes,yes,yes,no,no,300,5,no,no,no,no,no,no,no,no,PPCI,,,182,134,120,,14,434
93,Juni'19,44,L,61962806,4,no,no,no,yes,no,270,4.5,no,no,no,no,no,no,no,no,PPCI,,,176,159,146,,13,429
94,Juni'19,69,L,63962509,8,yes ,no,no,yes,no,2880,48,no,no,no,no,no,no,yes,no,Urgent PCI,,,,,,,,
95,Juni'19,75,L,60068809,8,yes,yes,no,no,yes,540,9,no,no,no,no,no,no,no,no,Conservatif,,,,,,,,
96,Juni'19,59,L,39778181,7,no,yes,yes,no,no,960,16,no,no,no,no,no,no,no,no,Conservatif,,,,,,,,
97,Juni'19,74,P,58310912,6,no,yes,yes,yes,no,2880,48,no,yes,no,no,no,no,yes,yes,Conservatif,,,,,,,,
98,Juli'19,65,L,70255081,1,no,no,yes,no,yes,240,4,no,no,no,no,no,no,no,yes,PPCI,,,334,319,227,,92,559
99,Juli'19,48,L,48266219,3,yes,no,yes,no,no,2880,48,no,no,no,no,no,no,no,no,PPCI,,,186,175,160,,15,3055
100,Juli'19,51,L,45957061,4,no,yes,yes,no,no,210,3.5,yes,no,no,no,no,no,no,no,PPCI,,,121,118,117,,1,328
101,Juli'19,57,L,52272560,4,yes,yes,no,no,yes,480,8,no,no,no,no,no,no,no,no,PPCI,,,234,227,221,,6,707
102,Juli'19,71,L,58194967,4,yes,no,no,no,no,120,2,no,no,no,no,no,no,no,no,PPCI,,,193,188,177,,11,308
103,Juli'19,53,L,44460335,4,no,yes,no,no,no,,,no,no,no,no,no,no,no,no,PPCI,,,176,160,138,,22,160
104,Juli'19,55,L,36469153,6,no,no,no,no,no,900,15,no,no,no,no,no,no,no,no,Conservatif,,,,,,,,
105,Juli'19,55,L,43457290,4,no,yes,no,no,no,360,6,no,no,no,no,no,no,no,no,PPCI,,,155,153,149,,4,513
106,Juli'19,42,L,47993563,8,no,no,yes,no,no,780,13,no,no,no,no,no,no,no,no,Conservatif,,,,,,,,
107,Agus'19,49,L,47430575,3,no,yes,no,no,no,180,3,no,no,no,no,no,no,no,no,PPCI,,,173,170,168,,2,350
108,Agus'19,46,L,46829128,3,no,no,yes,no,no,420,7,no,no,no,no,no,no,no,no,PPCI,,,239,188,144,,44,608
109,Agus'19,54,L,58039983,6,no,no,yes,no,no,150,2.5,no,no,no,no,no,no,no,no,PPCI ,,,199,164,106,,58,314
110,Agus'19,60,L,53320770,5,no,yes,no,no,no,300,5,no,no,no,no,no,no,no,no,PPCI,,,131,127,122,,5,427
111,Agus'19,60,L,51044811,4,yes,no,yes,no,no,240,4,no,no,no,no,no,no,no,no,PPCI,,,99,92,82,,10,332
112,Agus'19,59,L,57594663,5,no,no ,yes,yes,no,540,9,no,no,no,no,no,no,no,no,PPCI,,,168,128,117,,11,668
113,Agus'19,49,L,62569755,4,no,no,no,no,no,360,6,no,no,no,no,no,no,no,no,PPCI,,,101,126,111,,15,486
114,Agus'19,47,P,46630465,6,yes,yes,yes,yes,yes,840,14,yes,no,no,no,no,no,no,no,Conservatif,,,,,,,,
115,Agus'19,59,L,47644261,7,yes,yes,yes,no,no,2880,48,no,no,no,no,no,no,no,no,Conservatif,,,,,,,,
116,Agus'19,71,P,28726882,7,no,no,yes,no,no,4320,72,no,no,no,no,no,no,no,no,Conservatif,,,,,,,,
117,Sep'19,56,L,50268894,8,yes,yes,no,yes,no,420,7,no,no,no,no,no,no,no,no,PPCI,,,111,104,97,,7,524
118,Sep'19,65,L,62349929,4,no,yes,no,no,no,600,10,yes,no,no,no,no,no,no,no,PPCI,,,177,169,145,,24,769
119,Sep'19,54,L,43909971,5,yes,yes,yes,no,no,240,4,no,no,no,no,no,no,no,no,PPCI,,,138,135,135,,0,375
120,Sep'19,40,L,49008475,3,no,no,yes,no,no,360,6,no,no,no,no,no,no,no,no,PPCI,,,157,137,137,,0,497
121,Sep'19,49,L,59293113,7,yes,yes,no,no,no,450,7.5,yes,no,no,no,no,no,no,no,PPCI,,,166,161,152,,9,611
122,Sep'19,45,L,,10,yes,no,yes,no,no,480,8,no,no,no,no,no,no,no,no,PPCI,,,167,153,125,,28,633
123,Sep'19,53,L,43915551,10,no,yes,no,no,no,1440,24,no,no,no,no,no,no,no,no,Conservatif,,,,,,,,
124,Sep'19,54,L,47664792,5,no,no,yes,no,no,780,13,no,no,no,no,no,no,no,no,Conservatif,,,,,,,,
125,Sep'19,55,L,63284736,6,yes,yes,no,yes,no,600,10,no,no,no,no,no,no,no,no,PPCI,,,194,163,153,,10,763
126,Sep'19,61,P,50546315,5,no,no,no,no,no,15,15 menit,no,no,no,yes,no,no,no,no,PPCI,,,352,318,206,,112,333
127,Sep'19,62,L,115175942,9,yes,yes,yes,yes,no,660,11,no,no,no,yes,no,no,no,no,Conservatif,,,,,,,,
128,Sep'19,54,L,48319800,7,no,no,yes,no,no,210,3.5,no,no,no,no,no,no,no,no,PPCI,,,133,104,96,,8,314
129,Sep'19,47,P,37450253,5,no,no,no,no,no,1200,20,no,no,no,no,no,no,no,no,Conservatif,,,,,,,,
130,Sep'19,40,L,45254098,6,yes,yes,yes,yes,no,480,8,yes,no,no,no,no,no,no,no,PPCI,,,153,145,104,,41,625
131,Okt'19,54,L,55493185,5,no,yes,no,no,no,420,7,no,no,no,no,no,no,no,no,PPCI,,,124,109,103,,6,529
132,Okt'19,61,L,64372084,4,no ,no,yes,no,no,,,no,no,no,no,no,no,no,no,PPCI,,,238,169,121,,48,169
133,Okt'19,57,L,116864701,4,yes,no,no,no,no,180,3,no,no,no,no,no,no,no,no,PPCI,,,244,220,210,,10,400
134,Okt'19,61,L,47943944,4,yes,no,no,no,no,600,10,no,no,no,no,no,no,no,no,PPCI,,,165,160,128,,32,760
135,Okt'19,49,P,65008812,5,no,yes,no,no,no,480,8,no,no,no,no,no,no,no,no,PPCI,,,146,123,109,,14,603
136,Okt'19,55,L,56825007,7,yes,no,no,no,no,240,4,no,no,no,no,no,no,no,no,PPCI,,,258,248,109,,139,488
137,Okt'19,69,P,46845596,4,yes,no,no,yes,yes,540,9,yes,no,no,no,no,no,no,no,PPCI,,,238,230,215,,15,770
138,Okt'19,74,L,75028317,5,yes,no,yes,no,no,420,7,yes,no,no,no,no,no,no,no,PPCI,,,308,304,169,,135,724
139,Okt'19,61,L,55973292,6,no,yes,yes,no,no,660,11,no,no,no,no,no,no,no,no,PCI Urgent,,,,,,,,
140,Okt'19,46,L,56849025,6,yes,no,no,no,no,480,8,no,no,no,no,no,no,no,no,Conservatif,,,,,,,,
141,Okt'19,52,L,52988877,5,yes,yes,no,no,no,2880,48,no,no,no,no,no,no,no,no,Conservatif,,,,,,,,
142,Nov'19,36,L,45961032,4,yes,no,no,no,no,30,0.5,no,no,no,no,no,no,no,no,PPCI,,,184,154,143,,11,184
143,Nov'19,48,L,47606781,4,no,no,no,no,no,120,2,no,no,no,no,no,no,no,no,PPCI,,,378,364,198,,166,484
144,Nov'19,44,L,42049177,3,yes,no,no,no,no,300,5,no,no,no,no,no,no,no,no,PPCI,,,123,305,102,,203,605
145,Nov'19,78,P,49188206,4,no,yes,no,no,yes,600,10,no,no,no,no,no,no,no,no,PPCI,,,309,305,284,,21,905
146,Nov'19,46,P,59653853,3,yes,yes,yes,no,no,720,12,no,no,no,no,no,no,no,no,PPCI,,,194,168,153,,15,888
147,Nov'19,50,L,52683005,7,no,yes,no,no,no,2280,38,no,no,no,no,no,no,no,no,Conservatif,,,,,,,,
148,Nov'19,52,L,44460335,7,no,yes,no,yes,no,2880,48,no,no,no,no,no,no,no,no,Conservatif,,,,,,,,
149,Nov'19,69,L,23748469,5,no,yes,no,no,no,4320,72,no,no,no,no,no,no,no,no,Conservatif,,,,,,,,
150,Des'19,42,P,49744679,6,no,no,no,no,no,600,10,no,no,no,no,no,no,no,no,PPCI,,,234,227,219,,8,827
151,Des'19,46,L,52629298,3,yes,no,yes,no,no,570,9.5,no,no,no,no,no,no,no,no,PPCI,,,143,126,92,,34,696
152,Des'19,53,L,40868838,1,no,yes,no,no,no,360,6,no,no,no,no,no,no,yes,yes,PPCI,,,109,107,99,,8,467
153,Des'19,51,L,52205716,4,no,yes,yes,yes,no,300,5,no,no,no,no,no,no,no,no,PPCI,,,228,221,148,,73,521
154,Des'19,46,L,39774311,3,no,no,yes,no,no,300,5,no,no,no,no,no,no,no,no,PPCI,,,141,135,131,,4,435
155,Des'19,58,L,49994836,3,yes,yes,yes,no,no,240,4,no,no,no,no,no,no,no,no,PPCI,,,134,132,117,,15,372
156,Des'19,66,L,54786144,5,yes,no,no,yes,no,4320,72,no,no,no,no,no,no,no,no,PPCI,,,147,140,140,,0,4460
157,Des'19,50,L,45768596,5,yes,yes,yes,no,no,2880,48,no,no,no,no,no,no,no,no,Conservatif,,,,,,,,
158,Des'19,62,L,32008762,10,yes,yes,no,no,no,1080,18,no,no,no,no,no,no,no,no,Conservatif,,,,,,,,
159,Des'19,43,L,60684888,5,yes,yes,no,no,no,4320,72,no,no,no,no,no,no,no,no,PCI Urgent,,,,,,,,
160,Des'19,67,L,51267908,5,no,yes,yes,no,no,600,10,no,no,no,no,no,no,no,no,Conservatif,,,,,,,,
161,Jan'20,42,L,46348141,4,yes,no,no,no,no,480,8,yes,no,no,no,no,no,no,no,PPCI,,,206,202,193,,9,682
162,Jan'20,46,L,63335571,3,yes,no,no,no,no,120,2,no,no,no,no,no,no,no,no,PPCI,,,123,102,99,,3,222
163,Jan'20,52,P,67391669,8,yes,yes,yes,no,yes,180,3,no,no,no,no,no,no,no,no,PPCI,,,181,145,136,,9,325
164,Jan'20,65,L,67635567,5,no,yes,no,yes,yes,1800,30,no,no,no,no,no,no,no,no,PCI Urgent,,,,,,,,
165,Jan'20,53,L,56556760,4,no,no,yes,yes,no,540,9,no,no,no,no,no,no,no,no,PPCI,,,153,132,126,,6,672
166,Jan'20,45,L,61291146,4,no,yes,yes,no,no,420,7,no,no,no,no,no,no,no,no,PPCI,,,368,353,158,,195,773
167,Jan'20,59,L,56805015,5,yes,no,no,no,no,360,6,no,no,no,no,no,no,no,no,PPCI,,,227,220,141,,79,580
168,Jan'20,59,P,52855787,6,yes,yes,yes,no,no,90,1.5,no,no,no,no,no,no,no,no,PPCI,,,277,271,222,,49,361
169,Jan'20,66,L,45330162,4,no,yes,yes,no,no,300,5,no,no,no,no,no,no,no,no,PPCI,,,160,154,126,,28,454
170,Jan'20,47,L,6718866,3,no,yes,no,no,no,780,13,no,no,no,no,no,no,no,no,Conservatif,,,,,,,,
171,Jan'20,55,P,8447892,2,no,no,no,yes,no,1440,24,no,no,no,no,no,no,no,yes,Conservatif,,,,,,,,
172,Jan'20,56,P,33083777,4,no,yes,no,no,no,1440,24,no,no,no,no,no,no,no,no,Conservatif,,,,,,,,
173,Jan'20,64,L,9101150,3,yes,no,no,no,no,4320,72,no,no,no,no,no,no,no,no,Conservatif,,,,,,,,
174,Jan'20,51,L,26489079,7,no,yes,yes,no,no,240,4,no,no,no,no,no,no,no,no,Conservatif,,,,,,,,
175,Jan'20,44,L,45395232,7,no,yes,yes,no,no,1140,19,no,no,yes,no,no,no,no,no,Conservatif,,,,,,,,
176,Feb'20,51,L,42037779,3,yes,yes,no,no,no,360,6,no,no,no,no,no,no,no,no,PPCI,,,194,190,184,,6,550
177,Feb'20,58,L,58444448,4,yes,yes,no,no,no,360,6,no,no,no,no,no,no,no,no,PPCI,,,483,467,397,,70,827
178,Feb'20,50,L,68256451,11,no,no,no,no,no,450,7.5,no,no,no,no,no,no,yes,no,PPCI,,,175,169,159,,10,619
179,Feb'20,65,L,48610518,5,yes,yes,no,no,no,600,10,no,no,no,no,no,no,no,no,PPCI,,,161,141,122,,19,741
180,Feb'20,45,L,39157503,4,no,yes,yes,no,no,480,8,no,no,no,no,no,no,no,no,PPCI,,,293,288,288,,0,768
181,Feb'20,50,L,62844867,4,no,yes,no,no,no,420,7,no,no,no,no,no,no,no,no,PPCI,,,146,143,132,,11,563
182,Feb'20,59,L,73008144,3,yes,no,no,yes,no,720,12,no,no,no,no,no,no,yes,yes,Urgent PCI,,,,,,,,
183,Feb'20,59,L,57704526,5,no,no,no,no,yes,1260,21,no,no,no,no,no,no,no,no,Conservatif,,,,,,,,
184,Feb'20,49,L,57322892,11,yes,yes,yes,no,no,780,13,no,no,no,no,no,no,no,no,Conservatif,,,,,,,,
185,Feb'20,52,L,47485088,6,yes,yes,no,no,no,720,12,no,no,no,no,no,no,no,no,Conservatif,,,,,,,,
186,Feb'20,81,P,41455993,6,no,no,yes,no,no,1080,18,no,no,no,no,no,no,no,no,Conservatif,,,,,,,,
187,Feb'20,47,L,77505901,7,no,no,no,no,no,2160,36,no,no,yes,no,no,no,no,yes,Conservatif,,,,,,,,
188,Feb'20,60,L,44523756,11,no,no,no,no,no,4320,72,no,no,no,no,no,no,no,no,Conservatif,,,,,,,,
189,Maret'20,50,L,44372721,4,yes,yes,yes,no,no,240,4,no,no,no,no,no,no,no,no,PPCI,,,168,168,158,,10,408
190,Maret'20,33,P,59630202,7,yes,yes,no,no,no,420,7,yes,no,no,no,no,no,no,no,PPCI ,,,166,162,158,,4,582
,,,,,,,,,,,,,,,,,,,,,,,,,,,,,
,,,,,,,,,,,,,,,,,,,,,,,,,,,,,
,,,,,,,,,,,,,,,,,,,,,,,,,,,,,
,,,,,,,,,,,,,,,,,,,,,,,,,,,,,
,,,,,,,,,,,,,,,,,,,,,,,,,,,,,
,,,,,,,,,,,,,,,,,,,,,,,,,,,,,
NO,,UMUR,SEX,Cost (IDR),LOS,diabetes,hypertension,dyslipidemia,AKI,CKD,onset min,onset (hour),obesity,stroke,heart failure,lethal aritmia,pericarditis,tamponade jantung,cardiogenic shock,death,type of therapy,,D2NT (menit),D2BT,D2WT,Dx2WC,Dx2NT,Door to diagnosis,ischemic time
1,Mar'2020,61,L,62368188,5,no,yes,no,no,no,240,4,no,no,no,no,no,no,no,no,PPCI,,,178,156,143,,13,396
2,Mar'2020,63,L,189816378,25,no,yes,yes,no,no,540,9,no,no,no,no,no,no,no,no,Conservatif,,,,,,,,
3,Apr'2020,56,L,22263920,7,yes,no,no,no,no,5760,96,no,no,no,no,no,no,no,no,Conservatif,,,,,,,,
4,Apr'2020,66,L,65864979,6,no,yes,yes,no,no,,,no,no,no,no,no,no,no,yes,PPCI,,,450,436,408,,28,436
5,Apr'2020,68,L,42371012,7,no,yes,yes,no,no,840,14,no,no,no,no,no,no,no,no,Conservatif,,,,,,,,
6,Apr'2020,59,L,28168108,12,no,no,yes,no,no,1260,21,no,no,no,no,no,no,no,no,Conservatif,,,,,,,,
7,Apr'2020,62,L,457896988,19,yes,yes,no,yes,no,1380,23,no,no,no,no,no,no,no,no,Conservatif,,,,,,,,
8,Apr'2020,57,L,47695471,7,yes,yes,no,no,no,660,11,no,no,no,no,no,no,no,no,Conservatif,,,,,,,,
9,Apr'2020,58,L,44315793,10,yes,no,no,no,no,480,8,no,no,no,no,no,no,no,no,Conservatif,,,,,,,,
10,May'2020,51,L,43420404,19,yes,no,no,no,no,1200,20,no,no,no,yes,no,no,no,no,Conservatif,,,,,,,,
11,May'2020,63,L,100012866,> 12 jam,yes,no,no,yes,no,780,13,no,no,no,no,no,no,no,no,Conservatif,,,,,,,,
12,Jun'2020,62,L,58352283,4,no,yes,no,no,no,660,11,no,no,no,yes,,no,yes,no,PPCI,,,330,320,283,,37,980
13,Jun'2020,60,L,51919348,9,yes,yes,yes,no,no,540,9,no,no,no,no,no,no,no,no,Conservatif,,,,,,,,
14,Jun'2020,56,P,37022785,8,no,yes,no,no,yes,1320,22,no,no,no,no,no,no,no,no,Conservatif,,,,,,,,
15,Jul'2020,74,L,58242076,7,no,yes,no,no,no,360,6,no,no,no,no,no,no,no,no,PPCI,,,336,332,177,,155,692
16,Jul'2020,36,L,38414098,3,no,no,yes,no,no,240,4,no,no,no,no,no,no,no,no,PPCI,,,251,248,238,,10,488
17,Jul'2020,45,L,48576641,4,yes,yes,yes,no,no,60,1,no,no,no,no,no,no,no,no,PPCI,,,216,197,164,,33,257
18,Jul'2020,45,L,42190396,7,no,yes,no,yes,no,43440,724,no,no,no,no,no,no,no,no,Conservatif,,,,,,,,
19,Jul'2020,45,L,21995432,5,no,yes,no,no,no,600,10,no,no,no,no,no,no,no,no,Conservatif,,,,,,,,
20,Jul'2020,44,L,197670967,23,no,yes,yes,yes,no,240,4,no,no,no,no,no,no,no,no,Fibrinolytic,,160,,,,155,5,400
21,Jul'2020,58,L,60724996,6,yes,no,yes,no,no,300,5,no,no,no,no,no,no,no,no,Fibrinolytic,,212,,,,204,8,512
22,Jul'2020,50,P,47799999,5,yes,yes,yes,yes,no,4320,72,no,no,no,no,no,no,no,no,PPCI,,,248,246,240,,6,4566
23,Jul'2020,72,P,74257534,11,no,no,no,yes,no,1800,30,no,no,no,no,no,no,no,no,Urgent PCI,,,374,340,321,,19,2140
24,Jul'2020,54,L,54874771,8,yes,no,no,no,no,1260,21,no,no,no,no,no,no,no,no,Conservatif,,,,,,,,
25,Jul'2020,52,P,11519799,2,yes,yes,no,no,no,2880,48,no,no,no,no,no,no,no,yes,Conservatif,,,,,,,,
26,Jul'2020,62,L,5865423,2,yes,yes,no,yes,no,840,14,no,no,no,no,no,no,no,yes,Conservatif,,,,,,,,
27,Jul'2020,52,L,33080850,6,no,yes,yes,no,no,600,10,no,no,no,no,no,no,no,no,Fibrinolytic,,50,,,,34,16,650
28,Jul'2020,51,L,90402750,11,yes,no,yes,yes,no,660,11,no,no,no,no,no,no,no,no,PPCI,,,230,217,205,,12,877
29,Jul'2020,55,L,11163849,2,yes,no,no,no,no,720,12,no,no,no,no,no,no,no,yes,Conservatif,,,,,,,,
30,Agus'2020,66,L,126936116,15,yes,yes,no,no,no,300,5,no,no,no,yes,no,no,no,no,PPCI,,,305,304,68,,236,604
31,Agus'2020,52,L,61424680,7,no,no,no,no,no,420,7,yes,no,no,no,no,no,no,no,PPCI,,,148,143,134,,9,563
32,Agus'2020,76,L,22631370,4,no,yes,no,yes,no,60,1,no,no,no,no,no,no,no,no,PPCI,,,521,507,474,,33,567
33,Agus'2020,86,P,50054267,6,yes,yes,no,yes,no,330,5.5,no,no,no,no,no,no,no,no,PPCI,,,218,213,171,,42,543
34,Agus'2020,52,L,78675425,11,yes,yes,no,yes,no,2160,36,no,no,no,no,no,no,no,no,Conservatif,,,,,,,,
35,Agus'2020,70,L,74160075,15,no,yes,no,no,no,1320,22,no,no,no,no,no,no,yes,no,Urgent PCI,,,,,,,,
36,Agus'2020,44,L,48484232.25,7,no,yes,no,no,yes,1200,20,no,no,no,no,no,no,no,no,Conservatif,,,,,,,,
37,Agus'2020,62,L,58119724.21,7,no,yes,yes,no,no,180,3,no,no,no,no,no,no,no,no,PPCI,,,133,127,103,,24,307
38,Agus'2020,54,L,21200372.7,6,no,yes,no,no,no,780,13,no,no,no,no,no,no,no,no,Conservatif,,,,,,,,
39,Agus'2020,67,L,55616806.89,9,yes,yes,no,no,yes,5760,96,no,no,no,no,no,no,no,no,Conservatif,,,,,,,,
40,Agus'2020,62,L,27504837.38,7,no,yes,no,no,no,2880,48,no,no,no,no,no,no,no,no,Conservatif,,,,,,,,
41,Agus'2020,68,P,58124442.74,6,no,yes,no,no,no,120,2,no,no,yes,yes,no,no,no,no,Conservatif,,,,,,,,
42,Agus'2020,70,L,51431887.69,6,no,no,no,no,no,180,3,no,no,no,no,no,no,no,no,Fibrinolytic,,221,,,,216,5,401
43,Agus'2020,74,L,32243942.84,8,no,no,no,no,no,2880,48,no,no,no,no,no,no,no,no,Conservatif,,,,,,,,
44,Agus'2020,63,L,44737095.73,6,no,yes,yes,no,no,3000,50,no,no,no,no,no,no,no,no,Conservatif,,,,,,,,